{"text_format":"1","workbook":"xlsx","n_sheets":11,"sheets":["1. Proposal Details","2. Plan Macro Instructions","3. Plan","4. Reconciliation","5. Rate Calculation","6. Volume Projections","7. Rate List","8. Depreciation Schedule","9. Complete Content Checklist","2025-26 Forecast","EULID"],"not_rendered":{"charts":0,"images":5,"macros":1,"external_links":0,"defined_names":35,"comments":2,"pivot_tables":0},"unopened":[],"bounds":{"document_bytes":16777216,"sheet_cells":100000,"rows_first":2000,"rows_last":500,"rows_between":2000,"halvings":0,"cell_chars":16384,"cell_head_chars":4096},"cells_cut":0,"cells_raw":0,"read":"whole","date_system":"1900"}

{"sheet":"1. Proposal Details","index":0,"n_rows":48,"n_cols":30,"rows_kept":48,"cut":false,"hidden":false,"merged":[[4,4,4,10],[4,13,4,18],[18,21,21,22],[9,9,9,10],[10,9,10,10],[10,19,10,20],[10,15,10,17],[10,6,10,7],[14,12,15,13],[13,4,13,9],[14,7,15,9],[14,4,15,6],[13,26,13,30],[16,18,17,20],[18,18,19,20],[20,18,21,20],[16,14,17,17],[20,14,21,17],[14,14,15,17],[16,21,17,22],[13,21,15,22],[13,12,13,20],[14,18,15,20],[39,3,39,8],[41,3,41,8],[42,3,42,8],[16,3,21,3],[18,7,19,9],[37,3,37,15],[39,11,39,15],[40,11,40,15],[42,13,42,15],[41,13,41,15],[40,3,40,8],[20,7,21,9],[16,12,17,13],[16,7,17,9],[0,1,0,31],[9,12,9,13],[10,12,10,13],[34,1,34,31],[25,2,25,29],[16,4,17,6],[18,4,19,6],[20,4,21,6],[16,1,21,1],[28,28,28,29],[26,1,26,31],[1,1,1,23],[7,4,7,10],[7,13,7,18],[9,6,9,7],[18,14,19,17],[10,28,10,30],[9,19,9,20],[9,15,9,17],[45,24,45,26],[18,12,19,13],[20,12,21,13],[40,21,40,24],[45,15,45,16],[39,21,39,24],[42,21,42,24],[41,21,41,24],[37,21,37,28],[39,27,39,28],[40,27,40,28],[29,28,29,29],[16,27,21,29]]}
[null,"2026-27 RENEWAL RECHARGE PROPOSAL"]
[null,"     1. GENERAL INFORMATION",null,null,null,null,null,null,null,null,null,null,null,null,null,null,null,null,null,null,null,null,null,null,"     2. LOCATION OF RECHARGE ACTIVITY "]
[]
[null,"          Recharge ",null,null,null,null,null,null,null,null,null,null,"Recharge",null,null,null,null,null,null,"    Date",null,null,null,null,null,"          Choose the location of the recharge "]
[null,"          Activity Name:",null,null,null,null,null,null,null,null,null,null,"Manager:",null,null,null,null,null,null,"    Submitted:",null,null,null,null,null,null," activity from the list below:"]
[]
[null,"          Dept ",null,null,null,null,null,null,null,null,null,null,"Contact",null,null,null,null,null,null,"    Target",null,null,null,null,null,null,"   Parnassus"]
[null,"          Name: ",null,null,null,null,null,null,null,null,null,null,"Person:",null,null,null,null,null,null,"    Effective Date:",null,null,null,null,null,null,"   Mt. Zion"]
[null,null,null,null,null,null,null,null,null,null,null,null,null,null,null,null,null,null,null,null,null,null,null,null,null,null,"   Mission Bay"]
[null,"          Chartstring:",null,null,null,null,null,null,null,null,null,null,null,null,null,null,null,null,null,null,null,null,null,null,null,null,"   ZSFG"]
[null,null,null,null,"Fund",null,"Dept ID",null,null,"Function",null,null,"Parent Project",null,null,"Sub-Project",null,null,null,"Sub-Project",null,null,"Sub-Project",null,null,null,"   Other (describe):"]
[null,"          If you have additional projects, please list them in an attached addendum."]
[null,"     3. RISK LEVEL - 9-SQUARE ASSESSMENT"]
[null,null,null,null,"    Dollar Value                                          (Total Annual Expenses)",null,null,null,null,null,null,null,"Federal Participation (%)",null,null,null,null,null,null,null,null,"Recharge Risk Category",null,null,null,null,"Anticipated Federal Participation"]
[null,null,null,null,"Planned Expense \nRange",null,null,"Planned Expenses\nfrom Plan (page 3)",null,null,null,null,0,null,"> 0% to < 50%",null,null,null,"50% or higher"]
[null,null,null,null,null,null,null,null,null,null,null,null,null,null,null,null,null,null,null,null,null,null,null,null,null,null,null,null,null,"%"]
[null,null,null,"Annual Expenses ($)","< or = $100,000",null,null,{"$f":"IF(AND('3. Plan'!$J$45<100000.5,'3. Plan'!$J$45>0),'3. Plan'!$J$45,\"\")","v":""},null,null,null,null,"Low  ",null,"Low-Medium",null,null,null,"Medium",null,null,"CATEGORY 1",null,null,null,null,null,"Once the planned expense amount (far left column of this section) and anticipated percentage of federal participation (section above) are entered, both the appropriate risk level and category will be highlighted."]
[]
[null,null,null,null,"> $100,000 and                     < $500,000",null,null,{"$f":"IF(AND('3. Plan'!$J$45<500000,'3. Plan'!$J$45>100000.49),'3. Plan'!$J$45,\"\")","v":""},null,null,null,null,"Low-Medium",null,"Medium",null,null,null,"Medium-High",null,null,"CATEGORY 2"]
[]
{"$rows_left_out":29}
{"sheet":"2. Plan Macro Instructions","index":1,"n_rows":53,"n_cols":5,"rows_kept":53,"cut":false,"hidden":false,"merged":[[1,0,1,5],[2,0,2,5],[3,2,3,4],[0,0,0,5]]}
["2026-27 RENEWAL RECHARGE PROPOSAL "]
["Macro instructions to quickly populate the 3. Plan tab with the budget, actual, and forecast columns"]
["Be sure that your workbook is macro-enabled when prompted upon opening this .xlsm file"]
[]
["2024-25 BUDGET AND ACTUALS MACRO"]
[null,"MyReports"]
[null,null,"1. Select Monthly Report in the Operational Reports tab"]
[null,null,"2. Choose Fiscal Year 2024-25 from the dropdown box"]
[null,null,"3. In the Chartstring Filters section, add Fund 5018"]
[null,null,"4. To capture all projects and sub-project, enter the Parent Project in the Project Award/Parent filter"]
[null,null,"If there is a Surplus Revenue Project, exclude it by entering all other Projects into the Project filter instead"]
[null,null,"5. In Report Specific Filters section, select to Display Codes and Descriptions in the Display Codes and Descriptions dropdown"]
[null,null,"6. Select Excel in the Report Output Selection section"]
[null,null,"7. Click Run Report (keep this window open for later - Step 13)"]
[]
[null,"Excel"]
[null,null,"8. Open the resulting Excel file and click Enable Editing at the top"]
[null,null,"9. Right click on the Monthly Report tab to move a copy of the tab to the 2026-27 RENEWAL Proposal"]
[]
[null,null,"a. Select Move or Copy","b. Choose 2026-27 RENEWAL Proposal.xlsm ","c. Scroll down and select (move to end)"]
{"$rows_left_out":34}
{"sheet":"3. Plan","index":2,"n_rows":96,"n_cols":10,"rows_kept":96,"cut":false,"hidden":false,"merged":[[57,0,57,5],[32,0,32,4],[33,0,33,4],[34,0,34,4],[35,0,35,4],[36,0,36,4],[37,0,37,4],[43,0,43,5],[44,0,44,5],[46,0,46,5],[54,0,54,5],[56,0,56,5],[31,0,31,4],[10,0,10,4],[20,0,20,5],[22,0,22,9],[23,0,23,4],[24,0,24,4],[25,0,25,4],[26,0,26,4],[27,0,27,4],[28,0,28,4],[29,0,29,4],[30,0,30,4],[9,0,9,4],[0,0,0,9],[1,0,1,9],[2,5,2,7],[5,6,5,7],[8,0,8,9]]}
["2026-27 RENEWAL RECHARGE PROPOSAL"]
["PLAN"]
[null,null,null,null,"Recharge Activity Name:",{"$f":"IF('1. Proposal Details'!$E$5=\"\",\"\",'1. Proposal Details'!$E$5)","v":""}]
[null,null,null,null,"Recharge Fund-Dept ID-Project:",{"$f":"IF('1. Proposal Details'!$E$10=\"\",\"\",'1. Proposal Details'!$E$10)","v":""},{"$f":"IF('1. Proposal Details'!$G$10=\"\",\"\",'1. Proposal Details'!$G$10)","v":""},{"$f":"IF('1. Proposal Details'!$M$10=\"\",\"\",'1. Proposal Details'!$M$10)","v":""}]
[]
[null," ",null,null,null,null,"2024-25",null,"2025-26","2026-27"]
[null,null,null,null,null,"Level C","Budget","2025-06-30","Forecast","Plan"]
[null,null,null,null,null,"Accounts",null,"Actuals"]
["REVENUE:"]
["Sales and Service Revenue (External)",null,null,null,null,"4200C"]
["Recharge and Costed Central Act (Internal UCSF)",null,null,null,null,"4250C"]
["MC-Purchased Svcs Revenue",null,null,null,null,"4151C"]
["MC-Strategic Support",null,null,null,null,"4152C"]
["Other Clinical Revenue",null,null,null,null,"4153C"]
["Affiliation/Contract Revenue",null,null,null,null,"4154C"]
["Gift Revenue",null,null,null,null,"4351C"]
["Sponsored Project Rev Exc SFGH",null,null,null,null,"4500C"]
["Interest and Investment Income",null,null,null,null,"4550C"]
["Assessments ",null,null,null,null,"4600C"]
["Other Revenues",null,null,null,null,"4601C"]
{"$rows_left_out":77}
{"sheet":"4. Reconciliation","index":3,"n_rows":34,"n_cols":25,"rows_kept":34,"cut":false,"hidden":false,"merged":[[0,1,0,25],[1,1,1,25]]}
[null,"2026-27 RENEWAL RECHARGE PROPOSAL"]
[null,"RECONCILIATION OF PRIOR YEAR NET POSITION"]
[null,null,"Recharge activities with more than one service line must calculate the prior year net position to apply to each service"]
[null,null,"by reconciling actual revenue and expense for each service from the last approval through 2025-26."]
[]
[null,null,"Fill in the corresponding grayed-out cells below to calculate the Net position to apply to 2026-27 plan for each service. "]
[null,null,"If you need to account for additional services, unhide the additional data input columns by clicking  on the        above the "]
[null,null,"total column (column Y)."]
[]
[null,null,"Fiscal Years Reconciled:",null,null,"through","2025-26"]
[]
[null,null,null,null,"Service 1","Service 2 ","Service 3","Service 4","Service 5","Service 6","Service 7","Service 8","Service 9","Service 10","Service 11","Service 12","Service 13","Service 14","Service 15","Service 16","Service 17","Service 18","Service 19","Service 20","Total"]
[null,null,"Last Approved Rates"]
[null,null,"Volume"]
[null,null,"Revenue",null,{"$f":"E13*E14","v":0},{"$f":"F13*F14","v":0},0,0,0,0,{"$f":"K13*K14","v":0},0,0,0,0,0,0,0,0,0,0,{"$f":"V13*V14","v":0},0,0,{"$f":"SUM(E15:X15)","v":0}]
[]
[null,null,"Expenses"]
[null,null,"Personnel",null,null,null,null,null,null,null,null,null,null,null,null,null,null,null,null,null,null,null,null,null,{"$f":"SUM(E18:X18)","v":0}]
[null,null,"Services",null,null,null,null,null,null,null,null,null,null,null,null,null,null,null,null,null,null,null,null,null,0]
[null,null,"Supplies",null,null,null,null,null,null,null,null,null,null,null,null,null,null,null,null,null,null,null,null,null,0]
{"$rows_left_out":15}
{"sheet":"5. Rate Calculation","index":4,"n_rows":20,"n_cols":3,"rows_kept":20,"cut":false,"hidden":false,"merged":[[15,4,15,7],[0,0,0,10],[1,0,1,10],[3,1,3,10],[4,1,4,10],[5,1,5,10],[6,1,6,10],[2,1,2,10],[7,1,7,10],[8,1,8,10]]}
["2026-27 RENEWAL RECHARGE PROPOSAL"]
["RECHARGE RATE CALCULATION "]
[null,"1. Describe any major changes to the cost pool or allocation methodology since the last submitted proposal \n(including any FTE increases or decreases, non-payroll cost increases over 3% annually, significant changes in volume)."]
[]
[]
[]
[]
[]
[]
[null,"2.  Choose the applicable rate basis from the list below:"]
[null,null,"   Square Footage: All costs divided by amount of space to be supported"]
[null,null,"   Unit: All costs divided by the number of items provided"]
[null,null,"   Per Hour: All costs divided by the number of billable hours (work hours less down time); link to template is below:"]
[null,null,"   https://brm.ucsf.edu/recharge-review-job-aids#How-to-calculate-billable-hours-for-an-hourly-rate"]
[null,null,"   Prorated Personnel: All salary costs divided by the devoted activity time   "]
[null,null,"   Other (describe):"]
[]
[null,"3. Below insert a rate and revenue calculation that includes the detailed mathematical steps and computation(s) "]
[null,"used to calculate each recharge rate and a description of the rate methodology to support each cost allocation. "]
[null,"(ex: percent of total volume, percent of machine hours, etc.)"]
{"$rows_left_out":1}
{"sheet":"6. Volume Projections","index":5,"n_rows":19,"n_cols":9,"rows_kept":19,"cut":false,"hidden":false,"merged":[[3,2,4,8],[0,1,0,9],[1,1,1,9]]}
[null,"2026-27 RENEWAL RECHARGE PROPOSAL"]
[null,"ANNUAL VOLUME DATA FORECAST"]
[]
[null,null,"Below enter a description of the product or service and the actual recharged or forecasted number of units or hours for each service line."]
[]
[]
[null,null,"Service Description","2020-21 Actual Volume","2021-22 Actual Volume","2022-23 Actual Volume","2024-25\nActual \nVolume","2025-26\nVolume\nForecast","2026-27 Volume\nForecast"]
[null,null,"Service 1"]
[null,null,"Service 2"]
[null,null,"Service 3"]
[null,null,"Service 4"]
[null,null,"Service 5"]
[null,null,"Service 6"]
[null,null,"Service 7"]
[null,null,"Service 8"]
[null,null,"Service 9"]
[null,null,"Service 10"]
[null,null,"Service 11"]
[null,null,"Service 12"]

{"sheet":"7. Rate List","index":6,"n_rows":17,"n_cols":10,"rows_kept":17,"cut":false,"hidden":false,"merged":[[0,1,0,4],[1,1,1,4],[0,6,0,9],[1,6,1,9]]}
[null,"2026-27 NEW RECHARGE PROPOSAL",null,null,null,null,"2027-28 NEW RECHARGE PROPOSAL"]
[null,"RATE LIST",null,null,null,null,"RATE LIST"]
[null,"Services:","Units:","Internal \nRates:","External*\nRates:",null,"Services:","Units:","Internal \nRates:","External*\nRates:"]
[null,"Service 1",null,null,{"$f":"IFERROR(D4*1.33, )","v":0},null,"Service 1",null,null,{"$f":"IFERROR(I4*1.395, )","v":0}]
[null,"Service 2",null,null,{"$f":"IFERROR(D5*1.33, )","v":0},null,"Service 2",null,null,{"$f":"IFERROR(I5*1.395, )","v":0}]
[null,"Service 3",null,null,0,null,"Service 3",null,null,0]
[null,"Service 4",null,null,0,null,"Service 4",null,null,0]
[null,"Service 5",null,null,0,null,"Service 5",null,null,0]
[null,"Service 6",null,null,0,null,"Service 6",null,null,0]
[null,"Service 7",null,null,0,null,"Service 7",null,null,0]
[null,"Service 8",null,null,0,null,"Service 8",null,null,0]
[null,"Service 9",null,null,0,null,"Service 9",null,null,0]
[null,"Service 10",null,null,0,null,"Service 10",null,null,0]
[null,"Service 11",null,null,0,null,"Service 11",null,null,0]
[null,"Service 12",null,null,0,null,"Service 12",null,null,0]
[]
[null,"* Includes 33% Facilities and Administration Rate",null,null,null,null,"* Includes 39.5% Facilities and Administration Rate"]

{"sheet":"8. Depreciation Schedule","index":7,"n_rows":27,"n_cols":18,"rows_kept":27,"cut":false,"hidden":false,"merged":[[26,4,26,14],[37,1,37,13],[0,1,0,17],[1,1,1,17],[11,4,11,5],[9,4,9,6]]}
[null,"2026-27 RENEWAL RECHARGE PROPOSAL"]
[null,"EQUIPMENT DEPRECIATION SCHEDULE"]
[]
[null,null,null,null,"Notes:"]
[null,null,null,null,"Equipment purchased with Federal Funds cannot be depreciated on a recharge and should be deducted from the full cost."]
[null,null,null,null,"Equipment depreciation that is included in the Facilities and Administration (F&A) rate also may not be depreciated on a recharge. "]
[null,null,null,null,"Equipment purchased on or before December 31, 2023 that has not been previously depreciated on a recharge may not be included on the recharge."]
[null,null,null,null,"Schedules must be submitted using this format, and all fields must be completed."]
[null,null,null,null,"Proposals cannot be approved without a complete depreciation schedule."]
[null,null,null,null,"(insert additional worksheet(s) as needed)"]
[]
[null,null,null,null,"Recharge Activity Name:  ",null,null,null,{"$f":"IF('1. Proposal Details'!$E$5=\"\",\"\",'1. Proposal Details'!$E$5)","v":""}]
[]
[null,"(Insert additional lines as needed)",null,null,null,null,null,null,null,null,null,"(H - I)",null,"(J x K)",null,"(L / M)"]
[null,"Recharge\nFund","Recharge \nDept ID","Recharge\nParent Project","Description of Equipment","UC Equipment Tag Number","UCSF Asset ID","Profile ID","Acquisition Date","Full Cost                                                                                    ","Less: Fed Paid Amount","Net Cost","Percent of use by Recharge","Net Cost to Depreciate","Useful Life (Years)","Current Year Depreciation","Depreciation Start Date (MM/YY)","Depreciation End Date (MM/YY)"]
[null,{"$f":"IF('1. Proposal Details'!$E$10=\"\",\"\",'1. Proposal Details'!$E$10)","v":""},{"$f":"IF('1. Proposal Details'!$G$10=\"\",\"\",'1. Proposal Details'!$G$10)","v":""},{"$f":"IF('1. Proposal Details'!$M$10=\"\",\"\",'1. Proposal Details'!$M$10)","v":""},null,null,null,null,null,null,null,{"$f":"IF(J16=\"\",\"\",J16-K16)","v":""},null,{"$f":"IF(L16=\"\",\"\",L16*M16)","v":""},{"$f":"IFERROR(VLOOKUP(H16,EULID!A:B,2),\"\")","v":""},{"$f":"IFERROR(N16/O16, \"\")","v":""},null,{"$f":"IF(Q16=\"\",\"\",(EDATE(Q16,O16*12)-1))","v":""}]
[null,{"$f":"IF('1. Proposal Details'!$E$10=\"\",\"\",'1. Proposal Details'!$E$10)","v":""},{"$f":"IF('1. Proposal Details'!$G$10=\"\",\"\",'1. Proposal Details'!$G$10)","v":""},{"$f":"IF('1. Proposal Details'!$M$10=\"\",\"\",'1. Proposal Details'!$M$10)","v":""},null,null,null,null,null,null,null,{"$f":"IF(J17=\"\",\"\",J17-K17)","v":""},null,{"$f":"IF(L17=\"\",\"\",L17*M17)","v":""},{"$f":"IFERROR(VLOOKUP(H17,EULID!A:B,2),\"\")","v":""},{"$f":"IFERROR(N17/O17, \"\")","v":""},null,{"$f":"IF(Q17=\"\",\"\",(EDATE(Q17,O17*12)-1))","v":""}]
[null,{"$f":"IF('1. Proposal Details'!$E$10=\"\",\"\",'1. Proposal Details'!$E$10)","v":""},{"$f":"IF('1. Proposal Details'!$G$10=\"\",\"\",'1. Proposal Details'!$G$10)","v":""},{"$f":"IF('1. Proposal Details'!$M$10=\"\",\"\",'1. Proposal Details'!$M$10)","v":""},null,null,null,null,null,null,null,"",null,"",{"$f":"IFERROR(VLOOKUP(H18,EULID!A:B,2),\"\")","v":""},"",null,{"$f":"IF(Q18=\"\",\"\",(EDATE(Q18,O18*12)-1))","v":""}]
[null,{"$f":"IF('1. Proposal Details'!$E$10=\"\",\"\",'1. Proposal Details'!$E$10)","v":""},{"$f":"IF('1. Proposal Details'!$G$10=\"\",\"\",'1. Proposal Details'!$G$10)","v":""},{"$f":"IF('1. Proposal Details'!$M$10=\"\",\"\",'1. Proposal Details'!$M$10)","v":""},null,null,null,null,null,null,null,"",null,"",{"$f":"IFERROR(VLOOKUP(H19,EULID!A:B,2),\"\")","v":""},"",null,""]
[null,{"$f":"IF('1. Proposal Details'!$E$10=\"\",\"\",'1. Proposal Details'!$E$10)","v":""},{"$f":"IF('1. Proposal Details'!$G$10=\"\",\"\",'1. Proposal Details'!$G$10)","v":""},{"$f":"IF('1. Proposal Details'!$M$10=\"\",\"\",'1. Proposal Details'!$M$10)","v":""},null,null,null,null,null,null,null,"",null,"",{"$f":"IFERROR(VLOOKUP(H20,EULID!A:B,2),\"\")","v":""},"",null,""]
{"$rows_left_out":8}
{"sheet":"9. Complete Content Checklist","index":8,"n_rows":22,"n_cols":2,"rows_kept":22,"cut":false,"hidden":false,"merged":[]}
[null,"2026-27 RENEWAL RECHARGE PROPOSAL"]
[null,"CONTENT CHECKLIST FOR RENEWAL PROPOSALS"]
[null,"Category 2 proposals (proposals with planned expenses of $100,000 to $499,999 and federal participation greater than 50%, or with planned expenses greater than or equal to $500,000) must be submitted to Control Point for review and approval before submitting to  Budget and Resource Management.  All other proposals should be submitted directly to recharge@ucsf.edu and copy to Control Point."]
[null,"Recharge service(s) are fully identified and described."]
[null,"Recharge activities with more than one service line must calculate the prior year net position to apply to each service by reconciling actual revenue and expense for each service from the last approval through 2025-26."]
[null,"Detailed mathematical steps for rate calculations are provided."]
[null,"Detailed actual and forecasted volume data is provided for each service. "]
[null,"Description and justification of major changes to the cost pool or allocation methodology since the last submitted proposal is included."]
[null,"Rate list including all internal and external rates is provided."]
[null,"Unallowable expenditures per Uniform Guidance are not included (i.e., equipment purchases greater than $5,000, mail stop, phone lines, ID badges, entertainment, gifts, memberships, furniture, STIP expense, advertising expense, any expense that was already paid by the federal government, etc.)."]
[null,"The proposed 2026-27 plan breaks even."]
[null,"The 2024-25 Net Position (on proposal page 3 in cell H67) matches the 6/30/25 MyReports Net Position Report, \"Net Position End of Period\". "]
[null,"If equipment depreciation expense was planned in 2024-25, it has been moved to the equipment reserve fund. Equipment depreciation planned for 2025-26 is included in the forecast."]
[null,"If equipment depreciation expense is planned, all equipment items are identified on the depreciation schedule form with 12-digit UC property ID numbers and 9-digit Tag numbers."]
[null,"If Working Capital is planned, it is not more than 16.6% of planned expense."]
[null,"If a subsidy is planned, the application, amount and Dept ID-Fund-Project are provided."]
[null,"If external revenue is planned:\n     o      An external rate, including the Facilities and Administration rate of 33% for 2026-27, and 39.5% for 2027-28, at a minimum, has been calculated.\n     o      Facilities and Administration rate is not included in the plan."]
[null,"If the planned expenses are at least $500,000: the user committee has been identified, a member list has been provided, and a statement that the user committee has endorsed approval of the rates is included. Such statements must be substantiated by department records."]
[null,"The proposal, with all supplements, is being submitted electronically in Excel file format."]
[null,"For School of Medicine and School of Dentistry Departments, the following are also attached for Category 2 proposals:"]
{"$rows_left_out":3}
{"sheet":"2025-26 Forecast","index":9,"n_rows":63,"n_cols":18,"rows_kept":63,"cut":false,"hidden":false,"merged":[[62,0,62,1],[65,0,65,17],[55,0,55,1],[56,0,56,1],[57,0,57,1],[58,0,58,1],[60,0,60,1],[61,0,61,1],[54,0,54,1],[6,10,7,10],[6,11,7,11],[6,12,7,12],[6,13,7,13],[20,0,20,1],[21,0,21,1],[42,0,42,1],[43,0,43,1],[44,0,44,1],[8,0,8,1],[6,4,7,4],[6,5,7,5],[6,6,7,6],[6,7,7,7],[0,0,1,4],[0,5,1,10],[0,11,1,17],[4,0,7,1],[4,2,5,2],[4,3,4,14],[4,16,5,16],[4,17,5,17],[6,2,7,2],[6,3,7,3],[6,14,7,14],[6,8,7,8],[6,9,7,9]]}
[null,null,null,null,null,"2025-26 Forecast"]
[]
[]
[]
["Note: The gray columns contain Actuals and the clear columns contain the Forecast. Any necessary updates should only be made to the Forecast columns. The totals on this tab in column P will also be reflected in the Forecast column on tab 3. Plan.",null,"2025-26","2025-26"]
[null,null,null,"2025-07-01","2025-08-01","2025-09-01","2025-10-01","2025-11-01","2025-12-01","2026-01-01","2026-02-01","2026-03-01","2026-04-01","2026-05-01","2026-06-01"]
[null,null,"Plan","Actuals","Actuals","Actuals","Forecast","Forecast","Forecast","Forecast","Forecast","Forecast","Forecast","Forecast","Forecast","Total 2025-26","Plan / Forecast","Plan / Forecast"]
[null,null,null,null,null,null,null,null,null,null,null,null,null,null,null,"Actuals & Forecast","Variance ($)","Variance (%)"]
["  REVENUES"]
["MC-Purchased Svcs Revenue","4151C",null,null,null,null,null,null,null,null,null,null,null,null,null,{"$f":"SUM(D10:O10)","v":0},{"$f":"P10-C10","v":0},{"$f":"IFERROR(Q10/C10,\" \")","v":" "}]
["MC-Strategic Support","4152C",null,null,null,null,null,null,null,null,null,null,null,null,null,0,{"$f":"P11-C11","v":0}," "]
["Other Clinical Revenue","4153C",null,null,null,null,null,null,null,null,null,null,null,null,null,0,0," "]
["Affiliation/Contract Revenue","4154C",null,null,null,null,null,null,null,null,null,null,null,null,null,0,0," "]
["Sales and Service Revenue (External)","4200C",null,null,null,null,null,null,null,null,null,null,null,null,null,0,0," "]
["Recharge and Costed Central Act (Internal UCSF)","4250C",null,null,null,null,null,null,null,null,null,null,null,null,null,0,0," "]
["Other Revenues","4601C",null,null,null,null,null,null,null,null,null,null,null,null,null,0,0," "]
["Gift Revenue","4351C",null,null,null,null,null,null,null,null,null,null,null,null,null,0,0," "]
["Sponsored Project Rev Exc SFGH","4500C",null,null,null,null,null,null,null,null,null,null,null,null,null,0,0," "]
["Interest and Investment Income","4550C",null,null,null,null,null,null,null,null,null,null,null,null,null,0,0," "]
["Assessments ","4600C",null,null,null,null,null,null,null,null,null,null,null,null,null,0,0," "]
{"$rows_left_out":44}
{"sheet":"EULID","index":10,"n_rows":1017,"n_cols":3,"rows_kept":1017,"cut":false,"hidden":true,"merged":[]}
["Code","Life","Description"]
["A5000",20,"BOILERS"]
["A5003",10,"HEATERS, HOT-WATER HEATERS & SOLAR HEATING SYSTEMS"]
["A5006",20,"STOVES, WOOD BURNING"]
["A5020",5,"AIR CONDITIONERS,THRU-THE-WALL,UNDER 5 TON,VEHICLE,FLOOR,CENTRAL,PORTABLE,WINDOW"]
["A5021",10,"AIR CONDITIONER SYS, 5 TONS AND OVER"]
["A5030",10,"COOLERS, EVAPORATIVE"]
["A5033",10,"COMPRESSORS & CONDENSORS, REFRIGERATION, & ACCESSORIES"]
["A5040",15,"BLOWERS"]
["A5042",15,"HEATERS & COOLERS, CENTRAL SYSTEMS INCL FURNACES, DOMESTIC"]
["A5043",10,"PUMPS, HEAT INCL SYSTEMS"]
["A5045",10,"EXCHANGERS, THERMAL RECOVERY/HEAT,  AIR-TO-AIR"]
["A5050",15,"DEHUMIDIFIERS & HUMIDIFIERS"]
["A5052",10,"FANS,CENTRIFUGAL,AIR,DUST & FUME, INCINERATORS"]
["A5053",15,"CLEAN-AIR EQUIPMENT"]
["A5060",15,"STRUCTURES, TEMPORARY BUILDINGS, STATIONARY"]
["A5061",10,"STRUCTURES, TEMPORARY BUILDINGS, MOBILE"]
["A5090",10,"TOILETS, PORTABLE"]
["A5093",10,"STRUCTURES, STORAGE BUILDINGS, METAL GARDEN-TYPE INCL GREENHOUSES"]
["A5094",20,"STRUCTURES, STORAGE & WORKSPACE INCL STORAGE BUILDINGS, MASONRY, WOOD FRAME"]
{"$rows_left_out":997}